BDBM50003410 (Z)-3-(Benzyl-methoxy-amino)-1-(4-fluoro-phenyl)-propenone::3-(Benzyl-methoxy-amino)-1-(4-fluoro-phenyl)-propenone::CHEMBL11858
SMILES CON(Cc1ccccc1)\C=C/C(=O)c1ccc(F)cc1
InChI Key InChIKey=UOZHGUVLIGGFAC-QXMHVHEDSA-N
Data  4 IC50
  Tab Delimited (TSV)   2D SDfile   Computed 3D by Vconf -m prep SDfile
Find this compound or compounds like it in BindingDB:
Activity Spreadsheet -- Enzyme Inhibition Constant Data from BindingDB
Found 4 hits for monomerid = 50003410
TargetPolyunsaturated fatty acid 5-lipoxygenase(Rattus norvegicus)
Dupont Pharmaceuticals
Curated by ChEMBL
LigandPNGBDBM50003410((Z)-3-(Benzyl-methoxy-amino)-1-(4-fluoro-phenyl)-p...)
Affinity DataIC50: >2.50E+4nM. Assay description: inhibitory activity against 5-lipoxygenase in rat basophilic leukemia cell line.
In DepthDetails ArticlePubMed
TargetProstaglandin G/H synthase 1/2(Bos taurus)
TBA
Curated by ChEMBL
LigandPNGBDBM50003410((Z)-3-(Benzyl-methoxy-amino)-1-(4-fluoro-phenyl)-p...)
Affinity DataIC50: >7.50E+5nM. Assay description: Compound was evaluated for inhibition against cyclooxygenase of bovine seminal vesicles
In DepthDetails Article
TargetPolyunsaturated fatty acid 5-lipoxygenase(Rattus norvegicus)
Dupont Pharmaceuticals
Curated by ChEMBL
LigandPNGBDBM50003410((Z)-3-(Benzyl-methoxy-amino)-1-(4-fluoro-phenyl)-p...)
Affinity DataIC50: >2.50E+4nM. Assay description: Inhibition of 5-Lipoxygenase of rat basophilic leukemia cells
In DepthDetails Article
TargetPhospholipase A2, membrane associated(Homo sapiens (Human))
TBA
Curated by ChEMBL
LigandPNGBDBM50003410((Z)-3-(Benzyl-methoxy-amino)-1-(4-fluoro-phenyl)-p...)
Affinity DataIC50: >1.00E+6nM. Assay description: Compound was evaluated for inhibition against Phospholipase A2 of Croatalus adamanteus
In DepthDetails Article