BDBM50003421 1-(Benzyl-hydroxy-amino)-4,4-dimethyl-pent-1-en-3-one::CHEMBL334636
SMILES CC(C)(C)C(=O)\C=C/N(O)Cc1ccccc1
InChI Key InChIKey=VPMHCNUHSJWJHG-KTKRTIGZSA-N
Data  1 IC50
  Tab Delimited (TSV)   2D SDfile   Computed 3D by Vconf -m prep SDfile
Find this compound or compounds like it in BindingDB:
Activity Spreadsheet -- Enzyme Inhibition Constant Data from BindingDB
Found 1 hit for monomerid = 50003421
TargetPolyunsaturated fatty acid 5-lipoxygenase(Rattus norvegicus)
Dupont Pharmaceuticals
Curated by ChEMBL
LigandPNGBDBM50003421(1-(Benzyl-hydroxy-amino)-4,4-dimethyl-pent-1-en-3-...)
Affinity DataIC50:  5.00E+3nM. Assay description: inhibitory activity against 5-lipoxygenase in rat basophilic leukemia cell line.
In DepthDetails ArticlePubMed