BDBM50003425 CHEMBL130376::N-Acetoxy-1-benzylamino-4,4-dimethyl-pent-1-en-3-one
SMILES CC(=O)ON(Cc1ccccc1)C=CC(=O)C(C)(C)C
InChI Key InChIKey=MHNWZOCABKXDKJ-UHFFFAOYSA-N
Data  1 IC50
  Tab Delimited (TSV)   2D SDfile   Computed 3D by Vconf -m prep SDfile
Find this compound or compounds like it in BindingDB:
Activity Spreadsheet -- Enzyme Inhibition Constant Data from BindingDB
Found 1 hit for monomerid = 50003425
TargetPolyunsaturated fatty acid 5-lipoxygenase(Rattus norvegicus)
Dupont Pharmaceuticals
Curated by ChEMBL
LigandPNGBDBM50003425(CHEMBL130376 | N-Acetoxy-1-benzylamino-4,4-dimethy...)
Affinity DataIC50: >2.50E+4nM. Assay description: inhibitory activity against 5-lipoxygenase in rat basophilic leukemia cell line.
In DepthDetails ArticlePubMed