BDBM50003430 3-(Benzyl-hydroxy-amino)-1-(4-chloro-phenyl)-propenone::CHEMBL340654
SMILES ON(Cc1ccccc1)\C=C/C(=O)c1ccc(Cl)cc1
InChI Key InChIKey=JFWUMYNXIBNKSL-KHPPLWFESA-N
Data  1 IC50
  Tab Delimited (TSV)   2D SDfile   Computed 3D by Vconf -m prep SDfile
Find this compound or compounds like it in BindingDB:
Activity Spreadsheet -- Enzyme Inhibition Constant Data from BindingDB
Found 1 hit for monomerid = 50003430
TargetPolyunsaturated fatty acid 5-lipoxygenase(Rattus norvegicus)
Dupont Pharmaceuticals
Curated by ChEMBL
LigandPNGBDBM50003430(3-(Benzyl-hydroxy-amino)-1-(4-chloro-phenyl)-prope...)
Affinity DataIC50:  1.50E+3nM. Assay description: inhibitory activity against 5-lipoxygenase in rat basophilic leukemia cell line.
In DepthDetails ArticlePubMed