BDBM50003442 1-(4-Fluoro-phenyl)-3-(hydroxy-naphthalen-2-ylmethyl-amino)-propenone::CHEMBL130908
SMILES ON(Cc1ccc2ccccc2c1)\C=C/C(=O)c1ccc(F)cc1
InChI Key InChIKey=BXAZEIUQKBZWHS-QXMHVHEDSA-N
Data  1 IC50
  Tab Delimited (TSV)   2D SDfile   Computed 3D by Vconf -m prep SDfile
Find this compound or compounds like it in BindingDB:
Activity Spreadsheet -- Enzyme Inhibition Constant Data from BindingDB
Found 1 hit for monomerid = 50003442
TargetPolyunsaturated fatty acid 5-lipoxygenase(Rattus norvegicus)
Dupont Pharmaceuticals
Curated by ChEMBL
LigandPNGBDBM50003442(1-(4-Fluoro-phenyl)-3-(hydroxy-naphthalen-2-ylmeth...)
Affinity DataIC50:  400nM. Assay description: inhibitory activity against 5-lipoxygenase in rat basophilic leukemia cell line.
In DepthDetails ArticlePubMed