BDBM50003480 2,2-Diphenyl-1-[4-(1-pyridin-3-yl-ethyl)-piperazin-1-yl]-ethanone; hydrate::CHEMBL133565
SMILES CC(N1CCN(CC1)C(=O)C(c1ccccc1)c1ccccc1)c1cccnc1
InChI Key InChIKey=RDPIGJJMCNJXDP-UHFFFAOYSA-N
Data  1 IC50
  Tab Delimited (TSV)   2D SDfile   Computed 3D by Vconf -m prep SDfile
Find this compound or compounds like it in BindingDB:
Activity Spreadsheet -- Enzyme Inhibition Constant Data from BindingDB
Found 1 hit for monomerid = 50003480
TargetPlatelet-activating factor receptor(Cavia porcellus)
J. Uriach & C£A.S.A.
Curated by ChEMBL
LigandPNGBDBM50003480(2,2-Diphenyl-1-[4-(1-pyridin-3-yl-ethyl)-piperazin...)
Affinity DataIC50:  1.20E+3nM. Assay description: Concentration tested in vitro to inhibit PAF-induced maximum aggregation (PAF-Antagonistic activity) by 50%.
In DepthDetails ArticlePubMed