BDBM50003481 CHEMBL3215746::Pyridin-3-yl-{4-[3-(3,4,5-trimethoxy-phenyl)-propionyl]-piperazin-1-yl}-acetonitrile; dihydrochloride; hydrate
SMILES Cl.Cl.COc1cc(CCC(=O)N2CCN(CC2)C(C#N)c2cccnc2)cc(OC)c1OC
InChI Key InChIKey=DLXPZNFSYVMESM-UHFFFAOYSA-N
Data  1 IC50
  Tab Delimited (TSV)   2D SDfile   Computed 3D by Vconf -m prep SDfile
Find this compound or compounds like it in BindingDB:
Activity Spreadsheet -- Enzyme Inhibition Constant Data from BindingDB
Found 1 hit for monomerid = 50003481
TargetPlatelet-activating factor receptor(Cavia porcellus)
J. Uriach & C£A.S.A.
Curated by ChEMBL
LigandPNGBDBM50003481(CHEMBL3215746 | Pyridin-3-yl-{4-[3-(3,4,5-trimetho...)
Affinity DataIC50:  400nM. Assay description: Concentration tested in vitro to inhibit PAF-induced maximum aggregation (PAF-Antagonistic activity) by 50%.
In DepthDetails ArticlePubMed