BDBM50003499 CHEMBL338940::[4-(3-Hydroxy-3,3-diphenyl-propionyl)-piperazin-1-yl]-pyridin-4-yl-acetonitrile; hydrate
SMILES OC(CC(=O)N1CCN(CC1)C(C#N)c1ccncc1)(c1ccccc1)c1ccccc1
InChI Key InChIKey=FQQHZKLGYQTVQN-UHFFFAOYSA-N
Data  1 IC50
  Tab Delimited (TSV)   2D SDfile   Computed 3D by Vconf -m prep SDfile
Find this compound or compounds like it in BindingDB:
Activity Spreadsheet -- Enzyme Inhibition Constant Data from BindingDB
Found 1 hit for monomerid = 50003499
TargetPlatelet-activating factor receptor(Cavia porcellus)
J. Uriach & C£A.S.A.
Curated by ChEMBL
LigandPNGBDBM50003499(CHEMBL338940 | [4-(3-Hydroxy-3,3-diphenyl-propiony...)
Affinity DataIC50:  2.70nM. Assay description: Concentration tested in vitro to inhibit PAF-induced maximum aggregation (PAF-Antagonistic activity) by 50%.
In DepthDetails ArticlePubMed