BDBM50003525 CHEMBL133742::[4-(2,3-Diphenyl-acryloyl)-piperazin-1-yl]-pyridin-3-yl-acetonitrile; hydrate
SMILES O=C(N1CCN(CC1)C(C#N)c1cccnc1)C(=C\c1ccccc1)\c1ccccc1
InChI Key InChIKey=QHIGLBPANWMVOO-HKOYGPOVSA-N
Data  1 IC50
  Tab Delimited (TSV)   2D SDfile   Computed 3D by Vconf -m prep SDfile
Find this compound or compounds like it in BindingDB:
Activity Spreadsheet -- Enzyme Inhibition Constant Data from BindingDB
Found 1 hit for monomerid = 50003525
TargetPlatelet-activating factor receptor(Cavia porcellus)
J. Uriach & C£A.S.A.
Curated by ChEMBL
LigandPNGBDBM50003525(CHEMBL133742 | [4-(2,3-Diphenyl-acryloyl)-piperazi...)
Affinity DataIC50:  7.5nM. Assay description: Concentration tested in vitro to inhibit PAF-induced maximum aggregation (PAF-Antagonistic activity) by 50%.
In DepthDetails ArticlePubMed