BDBM50003556 CHEMBL133457::{4-[3-(Benzhydryl-amino)-propionyl]-piperazin-1-yl}-pyridin-4-yl-acetonitrile; hydrate; diethylether
SMILES O=C(CCNC(c1ccccc1)c1ccccc1)N1CCN(CC1)C(C#N)c1ccncc1
InChI Key InChIKey=KQBOPEOVYVGIOG-UHFFFAOYSA-N
Data  1 IC50
  Tab Delimited (TSV)   2D SDfile   Computed 3D by Vconf -m prep SDfile
Find this compound or compounds like it in BindingDB:
Activity Spreadsheet -- Enzyme Inhibition Constant Data from BindingDB
Found 1 hit for monomerid = 50003556
TargetPlatelet-activating factor receptor(Cavia porcellus)
J. Uriach & C£A.S.A.
Curated by ChEMBL
LigandPNGBDBM50003556(CHEMBL133457 | {4-[3-(Benzhydryl-amino)-propionyl]...)
Affinity DataIC50:  55nM. Assay description: Concentration tested in vitro to inhibit PAF-induced maximum aggregation (PAF-Antagonistic activity) by 50%.
In DepthDetails ArticlePubMed