BDBM50003757 9-(4-Chloro-benzenesulfonylamino)-8-pyridin-3-yl-nonanoic acid; hydrochloride::CHEMBL544150
SMILES OC(=O)CCCCCCC(CNS(=O)(=O)c1ccc(Cl)cc1)c1cccnc1
InChI Key InChIKey=ZYWROEIJJRJROC-UHFFFAOYSA-N
Data  1 IC50
  Tab Delimited (TSV)   2D SDfile   Computed 3D by Vconf -m prep SDfile
Find this compound or compounds like it in BindingDB:
Activity Spreadsheet -- Enzyme Inhibition Constant Data from BindingDB
Found 1 hit for monomerid = 50003757
TargetThromboxane-A synthase(Homo sapiens (Human))
Ciba-Geigy
Curated by ChEMBL
LigandPNGBDBM50003757(9-(4-Chloro-benzenesulfonylamino)-8-pyridin-3-yl-n...)
Affinity DataIC50:  240nM. Assay description: Inhibitory activity against human Thromboxane A2 synthase
In DepthDetails ArticlePubMed