BDBM50003772 8-(4-Methoxy-benzenesulfonylamino)-7-pyridin-3-yl-octanoic acid; hydrochloride::CHEMBL544148
SMILES COc1ccc(cc1)S(=O)(=O)NCC(CCCCCC(O)=O)c1cccnc1
InChI Key InChIKey=GERZDXZQUZQKFO-UHFFFAOYSA-N
Data  1 IC50
  Tab Delimited (TSV)   2D SDfile   Computed 3D by Vconf -m prep SDfile
Find this compound or compounds like it in BindingDB:
Activity Spreadsheet -- Enzyme Inhibition Constant Data from BindingDB
Found 1 hit for monomerid = 50003772
TargetThromboxane-A synthase(Homo sapiens (Human))
Ciba-Geigy
Curated by ChEMBL
LigandPNGBDBM50003772(8-(4-Methoxy-benzenesulfonylamino)-7-pyridin-3-yl-...)
Affinity DataIC50:  940nM. Assay description: Inhibitory activity against human Thromboxane A2 synthase
In DepthDetails ArticlePubMed