BDBM50003777 8-(4-Chloro-benzenesulfonylamino)-2-(5-pyridin-3-yl-pentyl)-octanoic acid::CHEMBL136904
SMILES OC(=O)C(CCCCCCNS(=O)(=O)c1ccc(Cl)cc1)CCCCCc1cccnc1
InChI Key InChIKey=STCLXOXMNLDBJD-UHFFFAOYSA-N
Data  1 IC50
  Tab Delimited (TSV)   2D SDfile   Computed 3D by Vconf -m prep SDfile
Find this compound or compounds like it in BindingDB:
Activity Spreadsheet -- Enzyme Inhibition Constant Data from BindingDB
Found 1 hit for monomerid = 50003777
TargetThromboxane-A synthase(Homo sapiens (Human))
Ciba-Geigy
Curated by ChEMBL
LigandPNGBDBM50003777(8-(4-Chloro-benzenesulfonylamino)-2-(5-pyridin-3-y...)
Affinity DataIC50:  4nM. Assay description: The compound was tested in vitro for its inhibitory activity against thromboxane synthase A2 (TXA2)
In DepthDetails ArticlePubMed