BDBM50003782 4-Chloro-N-[5-(3-hydroxy-propyl)-8-pyridin-3-yl-octyl]-benzenesulfonamide::CHEMBL136130
SMILES OCCCC(CCCCNS(=O)(=O)c1ccc(Cl)cc1)CCCc1cccnc1
InChI Key InChIKey=MWWHHLHEKJWLNU-UHFFFAOYSA-N
Data  1 IC50
  Tab Delimited (TSV)   2D SDfile   Computed 3D by Vconf -m prep SDfile
Find this compound or compounds like it in BindingDB:
Activity Spreadsheet -- Enzyme Inhibition Constant Data from BindingDB
Found 1 hit for monomerid = 50003782
TargetThromboxane-A synthase(Homo sapiens (Human))
Ciba-Geigy
Curated by ChEMBL
LigandPNGBDBM50003782(4-Chloro-N-[5-(3-hydroxy-propyl)-8-pyridin-3-yl-oc...)
Affinity DataIC50:  70nM. Assay description: In vitro inhibition of Thromboxane A2 synthase
In DepthDetails ArticlePubMed