BDBM50003783 8-(4-Chloro-benzenesulfonylamino)-2,2-dimethyl-4-(3-pyridin-3-yl-propyl)-octanoic acid::CHEMBL134365
SMILES CC(C)(CC(CCCCNS(=O)(=O)c1ccc(Cl)cc1)CCCc1cccnc1)C(O)=O
InChI Key InChIKey=OAJJFMYYSWJNDD-UHFFFAOYSA-N
Data  1 IC50
  Tab Delimited (TSV)   2D SDfile   Computed 3D by Vconf -m prep SDfile
Find this compound or compounds like it in BindingDB:
Activity Spreadsheet -- Enzyme Inhibition Constant Data from BindingDB
Found 1 hit for monomerid = 50003783
TargetThromboxane-A synthase(Homo sapiens (Human))
Ciba-Geigy
Curated by ChEMBL
LigandPNGBDBM50003783(8-(4-Chloro-benzenesulfonylamino)-2,2-dimethyl-4-(...)
Affinity DataIC50:  20nM. Assay description: In vitro inhibition of Thromboxane A2 synthase
In DepthDetails ArticlePubMed