BDBM50003787 4-Chloro-N-{8-pyridin-3-yl-5-[2-(5H-tetrazol-5-yl)-ethyl]-octyl}-benzenesulfonamide::CHEMBL138743
SMILES Clc1ccc(cc1)S(=O)(=O)NCCCCC(CCCc1cccnc1)CCc1nnn[nH]1
InChI Key InChIKey=KUJFJCSQRRNENV-UHFFFAOYSA-N
Data  1 IC50
  Tab Delimited (TSV)   2D SDfile   Computed 3D by Vconf -m prep SDfile
Find this compound or compounds like it in BindingDB:
Activity Spreadsheet -- Enzyme Inhibition Constant Data from BindingDB
Found 1 hit for monomerid = 50003787
TargetThromboxane-A synthase(Homo sapiens (Human))
Ciba-Geigy
Curated by ChEMBL
LigandPNGBDBM50003787(4-Chloro-N-{8-pyridin-3-yl-5-[2-(5H-tetrazol-5-yl)...)
Affinity DataIC50:  5nM. Assay description: In vitro inhibition of Thromboxane A2 synthase
In DepthDetails ArticlePubMed