BDBM50003800 8-(4-Methoxy-benzenesulfonylamino)-4-(3-pyridin-3-yl-propyl)-octanoic acid::CHEMBL344457
SMILES COc1ccc(cc1)S(=O)(=O)NCCCCC(CCCc1cccnc1)CCC(O)=O
InChI Key InChIKey=DGVWPPLXIBZQHJ-UHFFFAOYSA-N
Data  1 IC50
  Tab Delimited (TSV)   2D SDfile   Computed 3D by Vconf -m prep SDfile
Find this compound or compounds like it in BindingDB:
Activity Spreadsheet -- Enzyme Inhibition Constant Data from BindingDB
Found 1 hit for monomerid = 50003800
TargetThromboxane-A synthase(Homo sapiens (Human))
Ciba-Geigy
Curated by ChEMBL
LigandPNGBDBM50003800(8-(4-Methoxy-benzenesulfonylamino)-4-(3-pyridin-3-...)
Affinity DataIC50:  3nM. Assay description: In vitro inhibition of Thromboxane A2 synthase
In DepthDetails ArticlePubMed