BDBM50003804 7-(4-Chloro-benzenesulfonylamino)-3-(3-pyridin-3-yl-propyl)-heptanoic acid::CHEMBL345105
SMILES OC(=O)CC(CCCCNS(=O)(=O)c1ccc(Cl)cc1)CCCc1cccnc1
InChI Key InChIKey=YWBGOUXMIVCVPR-UHFFFAOYSA-N
Data  1 IC50
  Tab Delimited (TSV)   2D SDfile   Computed 3D by Vconf -m prep SDfile
Find this compound or compounds like it in BindingDB:
Activity Spreadsheet -- Enzyme Inhibition Constant Data from BindingDB
Found 1 hit for monomerid = 50003804
TargetThromboxane-A synthase(Homo sapiens (Human))
Ciba-Geigy
Curated by ChEMBL
LigandPNGBDBM50003804(7-(4-Chloro-benzenesulfonylamino)-3-(3-pyridin-3-y...)
Affinity DataIC50:  7nM. Assay description: In vitro inhibition of Thromboxane A2 synthase
In DepthDetails ArticlePubMed