BDBM50003828 6-[4,5-Bis-(4-fluoro-phenyl)-1H-imidazol-2-ylsulfanylmethyl]-4-methyl-5,6-dihydro-pyran-2-one::CHEMBL337107
SMILES CC1=CC(=O)OC(CSc2nc(c([nH]2)-c2ccc(F)cc2)-c2ccc(F)cc2)C1
InChI Key InChIKey=VBXYZAHREOVTKF-UHFFFAOYSA-N
Data  1 IC50
  Tab Delimited (TSV)   2D SDfile   Computed 3D by Vconf -m prep SDfile
Find this compound or compounds like it in BindingDB:
Activity Spreadsheet -- Enzyme Inhibition Constant Data from BindingDB
Found 1 hit for monomerid = 50003828
TargetSterol O-acyltransferase 1(Rattus norvegicus)
Rhone-Poulenc Rorer
Curated by ChEMBL
LigandPNGBDBM50003828(6-[4,5-Bis-(4-fluoro-phenyl)-1H-imidazol-2-ylsulfa...)
Affinity DataIC50:  610nM. Assay description: Inhibition of acyl coenzyme A:cholesterol acyltransferase (ACAT) activity in rat liver microsome
In DepthDetails ArticlePubMed