BDBM50003839 6-(4,5-Diphenyl-1H-imidazol-2-ylsulfanylmethyl)-4-methyl-tetrahydro-pyran-2,4-diol::CHEMBL136503
SMILES C[C@@]1(O)CC(O)O[C@@H](CSc2nc(c([nH]2)-c2ccccc2)-c2ccccc2)C1
InChI Key InChIKey=RCIAURCVMTWVOB-SLNGMPHYSA-N
Data  1 IC50
  Tab Delimited (TSV)   2D SDfile   Computed 3D by Vconf -m prep SDfile
Find this compound or compounds like it in BindingDB:
Activity Spreadsheet -- Enzyme Inhibition Constant Data from BindingDB
Found 1 hit for monomerid = 50003839
TargetSterol O-acyltransferase 1(Rattus norvegicus)
Rhone-Poulenc Rorer
Curated by ChEMBL
LigandPNGBDBM50003839(6-(4,5-Diphenyl-1H-imidazol-2-ylsulfanylmethyl)-4-...)
Affinity DataIC50:  160nM. Assay description: Inhibition of acyl coenzyme A:cholesterol acyltransferase (ACAT) activity in rat liver microsome
In DepthDetails ArticlePubMed