BDBM50003988 CHEMBL3236109
SMILES NC[C@H]1CN(C(=O)C[C@@H]1c1cc(F)ccc1F)c1ccc(nc1)C#N
InChI Key InChIKey=LQGNBFOSBXWJMN-NHYWBVRUSA-N
Data  1 IC50
  Tab Delimited (TSV)   2D SDfile   Computed 3D by Vconf -m prep SDfile
Find this compound or compounds like it in BindingDB:
Activity Spreadsheet -- Enzyme Inhibition Constant Data from BindingDB
Found 1 hit for monomerid = 50003988
TargetDipeptidyl peptidase 4(Homo sapiens (Human))
M.S. University Of Baroda
Curated by ChEMBL
LigandPNGBDBM50003988(CHEMBL3236109)
Affinity DataIC50:  404nM. Assay description: Inhibition of human DPP-4 expressed in baculovirus expression system using H-Gly-Pro-AMC as substrate after 30 mins by fluorometric analysis
In DepthDetails ArticlePubMed