BDBM50004018 3-(2-(1-benzylpiperidin-4-yl)ethyl)quinazoline-2,4(1H,3H)-dione::3-[2-(1-Benzyl-piperidin-4-yl)-ethyl]-1H-quinazoline-2,4-dione::CHEMBL342413
SMILES O=c1[nH]c2ccccc2c(=O)n1CCC1CCN(Cc2ccccc2)CC1
InChI Key InChIKey=NOUFYSVCMVOTOJ-UHFFFAOYSA-N
Data  2 IC50
  Tab Delimited (TSV)   2D SDfile   Computed 3D by Vconf -m prep SDfile
Find this compound or compounds like it in BindingDB:
Activity Spreadsheet -- Enzyme Inhibition Constant Data from BindingDB
Found 2 hits for monomerid = 50004018
TargetAcetylcholinesterase(Homo sapiens (Human))
Sichuan University
Curated by ChEMBL
LigandPNGBDBM50004018(3-(2-(1-benzylpiperidin-4-yl)ethyl)quinazoline-2,4...)
Affinity DataIC50:  4.20nM. Assay description: Inhibition of AChE
In DepthDetails ArticlePubMed
TargetAcetylcholinesterase(Mus musculus (mouse))
Eisai
Curated by ChEMBL
LigandPNGBDBM50004018(3-(2-(1-benzylpiperidin-4-yl)ethyl)quinazoline-2,4...)
Affinity DataIC50:  4.20nM. Assay description: In vitro inhibitory concentration against acetylcholinesterase (AChE) obtained from mouse brain homogenate.
In DepthDetails ArticlePubMed