BDBM50004023 2-(2-(1-methylpiperidin-4-yl)ethyl)-5-nitroisoindoline-1,3-dione::2-[2-(1-Methyl-piperidin-4-yl)-ethyl]-5-nitro-isoindole-1,3-dione::CHEMBL140948
SMILES CN1CCC(CCN2C(=O)c3ccc(cc3C2=O)[N+]([O-])=O)CC1
InChI Key InChIKey=SAWAJOAVUYQBDZ-UHFFFAOYSA-N
Data  2 IC50
  Tab Delimited (TSV)   2D SDfile   Computed 3D by Vconf -m prep SDfile
Find this compound or compounds like it in BindingDB:
Activity Spreadsheet -- Enzyme Inhibition Constant Data from BindingDB
Found 2 hits for monomerid = 50004023
TargetAcetylcholinesterase(Homo sapiens (Human))
Sichuan University
Curated by ChEMBL
LigandPNGBDBM50004023(2-(2-(1-methylpiperidin-4-yl)ethyl)-5-nitroisoindo...)
Affinity DataIC50:  6.80E+3nM. Assay description: Inhibition of AChE
In DepthDetails ArticlePubMed
TargetAcetylcholinesterase(Mus musculus (mouse))
Eisai
Curated by ChEMBL
LigandPNGBDBM50004023(2-(2-(1-methylpiperidin-4-yl)ethyl)-5-nitroisoindo...)
Affinity DataIC50:  6.80E+3nM. Assay description: In vitro inhibitory concentration against acetylcholinesterase (AChE) obtained from mouse brain homogenate.
In DepthDetails ArticlePubMed