BDBM50004157 2-Butyl-1-(2'-carboxy-biphenyl-4-ylmethyl)-6-methyl-4-phenyl-1,6-dihydro-pyrimidine-5-carboxylic acid ethyl ester::CHEMBL145017
SMILES CCCCC1=NC(=C(C(C)N1Cc1ccc(cc1)-c1ccccc1C(O)=O)C(=O)OCC)c1ccccc1
InChI Key InChIKey=XFLHXDDFBMSVHA-UHFFFAOYSA-N
Data  1 KI
  Tab Delimited (TSV)   2D SDfile   Computed 3D by Vconf -m prep SDfile
Find this compound or compounds like it in BindingDB:
Activity Spreadsheet -- Enzyme Inhibition Constant Data from BindingDB
Found 1 hit for monomerid = 50004157
TargetType-1 angiotensin II receptor B(RAT)
Bristol-Myers Squibb Pharmaceutical Research Institute
Curated by ChEMBL
LigandPNGBDBM50004157(2-Butyl-1-(2'-carboxy-biphenyl-4-ylmethyl)-6-methy...)
Affinity DataKi:  850nM. Assay description: Inhibition of [125I]- Sar,Ile8-angiotensin II binding to rat adrenal corticcal membrane angiotensin II receptor
In DepthDetails ArticlePubMed