BDBM50004160 CHEMBL145036::Sodium; 4'-(2-butyl-6-chloro-5-ethoxycarbonyl-4,4-dimethyl-4H-pyrimidin-1-ylmethyl)-biphenyl-2-carboxylate
SMILES CCCCC1=NC(C)(C)C(C(=O)OCC)=C(Cl)N1Cc1ccc(cc1)-c1ccccc1C([O-])=O
InChI Key InChIKey=ZRDDHPPVSIUFDX-UHFFFAOYSA-M
Data  1 KI
  Tab Delimited (TSV)   2D SDfile   Computed 3D by Vconf -m prep SDfile
Find this compound or compounds like it in BindingDB:
Activity Spreadsheet -- Enzyme Inhibition Constant Data from BindingDB
Found 1 hit for monomerid = 50004160
TargetType-1 angiotensin II receptor B(RAT)
Bristol-Myers Squibb Pharmaceutical Research Institute
Curated by ChEMBL
LigandPNGBDBM50004160(CHEMBL145036 | Sodium; 4'-(2-butyl-6-chloro-5-etho...)
Affinity DataKi:  58nM. Assay description: Inhibition of [125I]- Sar,Ile8-angiotensin II binding to rat adrenal corticcal membrane angiotensin II receptor
In DepthDetails ArticlePubMed