BDBM50004190 3-Acetoxymethyl-7-methyl-5,5,8-trioxo-5lambda*6*-thia-1-aza-bicyclo[4.2.0]oct-2-ene-2-carboxylic acid tert-butyl ester::CHEMBL145953
SMILES C[C@H]1[C@H]2N(C1=O)C(C(=O)OC(C)(C)C)=C(COC(C)=O)CS2(=O)=O
InChI Key InChIKey=FZSXTEWUAWLYKA-OQPBUACISA-N
Data  1 IC50
  Tab Delimited (TSV)   2D SDfile   Computed 3D by Vconf -m prep SDfile
Find this compound or compounds like it in BindingDB:
Activity Spreadsheet -- Enzyme Inhibition Constant Data from BindingDB
Found 1 hit for monomerid = 50004190
TargetNeutrophil elastase(Homo sapiens (Human))
Boehringer Ingelheim Pharmaceuticals
Curated by ChEMBL
LigandPNGBDBM50004190(3-Acetoxymethyl-7-methyl-5,5,8-trioxo-5lambda*6*-t...)
Affinity DataIC50:  107nMpH: 7.5Assay Description:Inhibitory activity against human leukocyte elastase (HLE) at pH 7.5
In DepthDetails ArticlePubMed