BDBM50004191 4-{2-[(2-Benzyloxycarbonylamino-3-methyl-butyryl)-indan-2-yl-amino]-acetylamino}-2,2-difluoro-6-methyl-3-oxo-heptanoic acid ethyl ester::CHEMBL445912
SMILES CCOC(=O)C(F)(F)C(=O)C(CC(C)C)NC(=O)CN(C1Cc2ccccc2C1)C(=O)C(NC(=O)OCc1ccccc1)C(C)C
InChI Key InChIKey=UVWQDIOAAZKQMN-UHFFFAOYSA-N
Data  1 IC50
  Tab Delimited (TSV)   2D SDfile   Computed 3D by Vconf -m prep SDfile
Find this compound or compounds like it in BindingDB:
Activity Spreadsheet -- Enzyme Inhibition Constant Data from BindingDB
Found 1 hit for monomerid = 50004191
TargetNeutrophil elastase(Homo sapiens (Human))
Boehringer Ingelheim Pharmaceuticals
Curated by ChEMBL
LigandPNGBDBM50004191(4-{2-[(2-Benzyloxycarbonylamino-3-methyl-butyryl)-...)
Affinity DataIC50:  1.11E+4nMpH: 7.5Assay Description:Inhibitory activity against human leukocyte elastase (HLE) at pH 7.5
In DepthDetails ArticlePubMed