BDBM50004277 2-Oxo-1,2-dihydro-quinoline-4-carboxylic acid (8-methyl-8-aza-bicyclo[3.2.1]oct-3-yl)-amide::CHEMBL343836
SMILES CN1C2CCC1CC(C2)NC(=O)c1cc(=O)[nH]c2ccccc12
InChI Key InChIKey=UFYDVRVTAXIMBS-UHFFFAOYSA-N
Data  1 KI
  Tab Delimited (TSV)   2D SDfile   Computed 3D by Vconf -m prep SDfile
Find this compound or compounds like it in BindingDB:
Activity Spreadsheet -- Enzyme Inhibition Constant Data from BindingDB
Found 1 hit for monomerid = 50004277
Target5-hydroxytryptamine receptor 3A/3B(Rattus norvegicus)
Kyowa Hakko Kogyo
Curated by ChEMBL
LigandPNGBDBM50004277(2-Oxo-1,2-dihydro-quinoline-4-carboxylic acid (8-m...)
Affinity DataKi: >100nM. Assay description: Ability to displace [3H]quipazine binding to 5-hydroxytryptamine 3 receptor sites in NG 108-15.
In DepthDetails ArticlePubMed