BDBM50004298 2-Isopropoxy-quinoline-4-carboxylic acid (8-methyl-8-aza-bicyclo[3.2.1]oct-3-yl)-amide::CHEMBL332037
SMILES CC(C)Oc1cc(C(=O)NC2CC3CCC(C2)N3C)c2ccccc2n1
InChI Key InChIKey=JXOLMXLINBXECI-UHFFFAOYSA-N
Data  1 KI
  Tab Delimited (TSV)   2D SDfile   Computed 3D by Vconf -m prep SDfile
Find this compound or compounds like it in BindingDB:
Activity Spreadsheet -- Enzyme Inhibition Constant Data from BindingDB
Found 1 hit for monomerid = 50004298
Target5-hydroxytryptamine receptor 3A/3B(Rattus norvegicus)
Kyowa Hakko Kogyo
Curated by ChEMBL
LigandPNGBDBM50004298(2-Isopropoxy-quinoline-4-carboxylic acid (8-methyl...)
Affinity DataKi:  53nM. Assay description: Ability to displace [3H]quipazine binding to 5-hydroxytryptamine 3 receptor sites in NG 108-15.
In DepthDetails ArticlePubMed