BDBM50004382 2-{4-[(4-Chloro-2-methyl-quinolin-6-ylmethyl)-amino]-benzoylamino}-pentanedioic acid ; hydrate::CHEMBL96086
SMILES Cc1cc(Cl)c2cc(CNc3ccc(cc3)C(=O)N[C@@H](CCC(O)=O)C(O)=O)ccc2n1
InChI Key InChIKey=WYUZFANHEGPQLB-FQEVSTJZSA-N
Data  1 IC50
  Tab Delimited (TSV)   2D SDfile   Computed 3D by Vconf -m prep SDfile
Find this compound or compounds like it in BindingDB:
Activity Spreadsheet -- Enzyme Inhibition Constant Data from BindingDB
Found 1 hit for monomerid = 50004382
TargetThymidylate synthase(Mus musculus)
Ici Pharmaceuticals Group
Curated by ChEMBL
LigandPNGBDBM50004382(2-{4-[(4-Chloro-2-methyl-quinolin-6-ylmethyl)-amin...)
Affinity DataIC50:  3.80E+4nM. Assay description: In vitro inhibitory activity against thymidylate synthase from L1210 mouse leukemia cells
In DepthDetails ArticlePubMed