BDBM50004404 CHEMBL317370::{1-[1-{1-Cyclohexylmethyl-2-hydroxy-3-[(1-oxy-1-aza-bicyclo[2.2.2]oct-3-ylcarbamoyl)-methanesulfonyl]-propylcarbamoyl}-2-(1H-imidazol-4-yl)-ethylcarbamoyl]-2-phenyl-ethyl}-carbamic acid tert-butyl ester
SMILES CC(C)(C)OC(=O)N[C@@H](Cc1ccccc1)C(=O)N[C@@H](Cc1cnc[nH]1)C(=O)N[C@@H](CC1CCCCC1)[C@@H](O)CS(=O)(=O)CC(=O)NC1C[N+]2([O-])CCC1CC2
InChI Key InChIKey=CFQJOCYCVRMDEC-JMCMPXHESA-N
Data  1 IC50
  Tab Delimited (TSV)   2D SDfile   Computed 3D by Vconf -m prep SDfile
Find this compound or compounds like it in BindingDB:
Activity Spreadsheet -- Enzyme Inhibition Constant Data from BindingDB
Found 1 hit for monomerid = 50004404
TargetRenin(Homo sapiens (Human))
Merck Research Laboratories
Curated by ChEMBL
LigandPNGBDBM50004404(CHEMBL317370 | {1-[1-{1-Cyclohexylmethyl-2-hydroxy...)
Affinity DataIC50:  4.20nM. Assay description: Inhibition of human plasma renin
In DepthDetails ArticlePubMed