BDBM50004409 CHEMBL320686::{1-[1-{1-Cyclohexylmethyl-2-hydroxy-3-[2-(4-methyl-piperazin-1-yl)-2-oxo-ethanesulfonyl]-propylcarbamoyl}-2-(1H-imidazol-4-yl)-ethylcarbamoyl]-2-phenyl-ethyl}-carbamic acid tert-butyl ester
SMILES CN1CCN(CC1)C(=O)CS(=O)(=O)C[C@H](O)[C@H](CC1CCCCC1)NC(=O)[C@H](Cc1cnc[nH]1)NC(=O)[C@H](Cc1ccccc1)NC(=O)OC(C)(C)C
InChI Key InChIKey=SJYFMYYDKCEPKC-YDPTYEFTSA-N
Data  1 IC50
  Tab Delimited (TSV)   2D SDfile   Computed 3D by Vconf -m prep SDfile
Find this compound or compounds like it in BindingDB:
Activity Spreadsheet -- Enzyme Inhibition Constant Data from BindingDB
Found 1 hit for monomerid = 50004409
TargetRenin(Homo sapiens (Human))
Merck Research Laboratories
Curated by ChEMBL
LigandPNGBDBM50004409(CHEMBL320686 | {1-[1-{1-Cyclohexylmethyl-2-hydroxy...)
Affinity DataIC50:  20nM. Assay description: Inhibition of human plasma renin
In DepthDetails ArticlePubMed