BDBM50004487 CCK7 analogue::CHEMBL408286
SMILES CCCC[C@H](NC(=O)c1ccc2cc(OS(O)(=O)=O)ccc2c1)C(=O)NCC(=O)N[C@@H](Cc1c[nH]c2ccccc12)C(=O)N[C@@H](CCCC)C(=O)N[C@@H](CC(O)=O)C(=O)N[C@@H](Cc1ccccc1)C(N)=O
InChI Key InChIKey=MPLZTZIWSHXYGD-LSLOANPCSA-N
Data  2 IC50
  Tab Delimited (TSV)   2D SDfile   Computed 3D by Vconf -m prep SDfile
Find this compound or compounds like it in BindingDB:
Activity Spreadsheet -- Enzyme Inhibition Constant Data from BindingDB
Found 2 hits for monomerid = 50004487
TargetCholecystokinin receptor type A(Cavia porcellus)
Abbott Laboratories
Curated by ChEMBL
LigandPNGBDBM50004487(CCK7 analogue | CHEMBL408286)
Affinity DataIC50:  900nM. Assay description: Evaluated in vitro for its binding affinity towards cholecystokinin type A receptor of guinea pig pancreas
In DepthDetails ArticlePubMed
TargetGastrin/cholecystokinin type B receptor(Homo sapiens (Human))
Abbott Laboratories
Curated by ChEMBL
LigandPNGBDBM50004487(CCK7 analogue | CHEMBL408286)
Affinity DataIC50:  32nM. Assay description: Evaluated in vitro for its binding affinity towards cholecystokinin type B receptor of guinea pig cortex
In DepthDetails ArticlePubMed