BDBM50004489 CCK7 analogue::CHEMBL318010
SMILES CCCC[C@H](NC(=O)[C@H](Cc1c[nH]c2ccccc12)NC(=O)CNC(=O)CNC(=O)CCc1ccc(OS(O)(=O)=O)cc1)C(=O)N[C@@H](CC(O)=O)C(=O)N[C@@H](Cc1ccccc1)C(N)=O
InChI Key InChIKey=DZFMLNMPSVVWNC-BBACVFHCSA-N
Data  2 IC50  1 EC50
  Tab Delimited (TSV)   2D SDfile   Computed 3D by Vconf -m prep SDfile
Find this compound or compounds like it in BindingDB:
Activity Spreadsheet -- Enzyme Inhibition Constant Data from BindingDB
Found 3 hits for monomerid = 50004489
TargetCholecystokinin receptor type A/Gastrin/cholecystokinin type B receptor(Homo sapiens (Human))
Abbott Laboratories
Curated by ChEMBL
LigandPNGBDBM50004489(CCK7 analogue | CHEMBL318010)
Affinity DataEC50:  3.70nM. Assay description: Thermodynamic dissociation constant of compound for wild type E. coli dihydrofolate reductase
In DepthDetails ArticlePubMed
TargetCholecystokinin receptor type A(Cavia porcellus)
Abbott Laboratories
Curated by ChEMBL
LigandPNGBDBM50004489(CCK7 analogue | CHEMBL318010)
Affinity DataIC50:  5.80nM. Assay description: Evaluated in vitro for its binding affinity towards cholecystokinin type A receptor of guinea pig pancreas
In DepthDetails ArticlePubMed
TargetGastrin/cholecystokinin type B receptor(Homo sapiens (Human))
Abbott Laboratories
Curated by ChEMBL
LigandPNGBDBM50004489(CCK7 analogue | CHEMBL318010)
Affinity DataIC50:  3.40nM. Assay description: Evaluated in vitro for its binding affinity towards cholecystokinin type B receptor of guinea pig cortex
In DepthDetails ArticlePubMed