BDBM50004552 5-(Isobutylamino-methyl)-thieno[2,3-b]furan-2-sulfonic acid amide::CHEMBL105713
SMILES CC(C)CNCc1cc2cc(oc2s1)S(N)(=O)=O
InChI Key InChIKey=BAIISSWGEDKHNE-UHFFFAOYSA-N
Data  1 KI
  Tab Delimited (TSV)   2D SDfile   Computed 3D by Vconf -m prep SDfile
Find this compound or compounds like it in BindingDB:
Activity Spreadsheet -- Enzyme Inhibition Constant Data from BindingDB
Found 1 hit for monomerid = 50004552
TargetCarbonic anhydrase 2(Homo sapiens (Human))
Merck Research Laboratories
Curated by ChEMBL
LigandPNGBDBM50004552(5-(Isobutylamino-methyl)-thieno[2,3-b]furan-2-sulf...)
Affinity DataKi:  7.40nM. Assay description: Compound was evaluated for the inhibition of dansylamide at human carbonic anhydrase II
In DepthDetails ArticlePubMed