BDBM50004582 8-Dicyclopropylmethyl-1,3,7-tripropyl-3,7-dihydro-purine-2,6-dione::CHEMBL101800
SMILES CCCn1c(nc2n(CCC)c(=O)n(CCC)c(=O)c12)C(C1CC1)C1CC1
InChI Key InChIKey=JBFCBDIKKKXIFW-UHFFFAOYSA-N
Data  4 KI
  Tab Delimited (TSV)   2D SDfile   Computed 3D by Vconf -m prep SDfile
Find this compound or compounds like it in BindingDB:
Activity Spreadsheet -- Enzyme Inhibition Constant Data from BindingDB
Found 4 hits for monomerid = 50004582
TargetAdenosine receptor A2a/A2b(Rattus norvegicus)
Kyowa Hakko Kogyo
Curated by ChEMBL
LigandPNGBDBM50004582(8-Dicyclopropylmethyl-1,3,7-tripropyl-3,7-dihydro-...)
Affinity DataKi:  6.30E+3nM. Assay description: Binding affinity carried out with [3H]5'-(N-ethylcarbamoyl)-adenosine in the presence of 50 nM cyclopentyladenosine in rat striatal membranes against...
In DepthDetails ArticlePubMed
TargetAdenosine receptor A2a/A2b(Rattus norvegicus)
Kyowa Hakko Kogyo
Curated by ChEMBL
LigandPNGBDBM50004582(8-Dicyclopropylmethyl-1,3,7-tripropyl-3,7-dihydro-...)
Affinity DataKi:  6.30E+3nM. Assay description: Binding affinity against adenosine A2 receptor in rat striatal membranes using N-[3H]-ethyladenosin-5''-uronamide as radioligand in the presence of 5...
In DepthDetails ArticlePubMed
TargetAdenosine receptor A1(GUINEA PIG)
Kyowa Hakko Kogyo
Curated by ChEMBL
LigandPNGBDBM50004582(8-Dicyclopropylmethyl-1,3,7-tripropyl-3,7-dihydro-...)
Affinity DataKi:  1.30E+4nM. Assay description: Binding affinity carried out with [3H]-cyclohexyladenosine in guinea pig forebrain membranes against adenosine A1 receptor
In DepthDetails ArticlePubMed
TargetAdenosine receptor A1(GUINEA PIG)
Kyowa Hakko Kogyo
Curated by ChEMBL
LigandPNGBDBM50004582(8-Dicyclopropylmethyl-1,3,7-tripropyl-3,7-dihydro-...)
Affinity DataKi:  1.30E+4nM. Assay description: Binding affinity against adenosine A1 receptor in guinea pig forebrain membranes using N6-[3H]cyclohexyladenosine as radioligand
In DepthDetails ArticlePubMed