BDBM50004602 2-[2-benzylcarboxamido(ethylcarbamoyl)methyl-5,5-dimethyl-(2R,4S)-1,3-thiazolan-4-ylcarbonyloxy]ethyl 2-benzylcarboxamido(ethylcarbamoyl)methyl-5,5-dimethyl-(2R,4S)-1,3-thiazolane-4-carboxylate::CHEMBL316813
SMILES CCNC(=O)[C@@H](NC(=O)Cc1ccccc1)[C@@H]1N[C@@H](C(=O)OCCOC(=O)[C@@H]2N[C@H](SC2(C)C)[C@H](NC(=O)Cc2ccccc2)C(=O)NCC)C(C)(C)S1
InChI Key InChIKey=CDTRLNFVEHPOII-IYNZBFDPSA-N
Data  1 IC50
  Tab Delimited (TSV)   2D SDfile   Computed 3D by Vconf -m prep SDfile
Find this compound or compounds like it in BindingDB:
Activity Spreadsheet -- Enzyme Inhibition Constant Data from BindingDB
Found 1 hit for monomerid = 50004602
TargetGag-Pol polyprotein [489-587](Human immunodeficiency virus type 1)
Glaxo Group Research
Curated by ChEMBL
LigandPNGBDBM50004602(2-[2-benzylcarboxamido(ethylcarbamoyl)methyl-5,5-d...)
Affinity DataIC50: >1.20E+4nM. Assay description: Inhibitory activity towards HIV-1 protease
In DepthDetails ArticlePubMed