BDBM50004604 2-(2-Acetylamino-3-phenyl-propionylamino)-5-guanidino-pentanoic acid (1-carbamoyl-2-hydroxy-ethyl)-amide::CHEMBL322972
SMILES CC(=O)N[C@@H](Cc1ccccc1)C(=O)N[C@@H](CCCNC(N)=N)C(=O)N[C@@H](CO)C(N)=O
InChI Key InChIKey=HVLFXNHKZMVSAK-JYJNAYRXSA-N
Data  1 KI
  Tab Delimited (TSV)   2D SDfile   Computed 3D by Vconf -m prep SDfile
Find this compound or compounds like it in BindingDB:
Activity Spreadsheet -- Enzyme Inhibition Constant Data from BindingDB
Found 1 hit for monomerid = 50004604
TargetKallikrein(Sus scrofa)
University Hospital
Curated by ChEMBL
LigandPNGBDBM50004604(2-(2-Acetylamino-3-phenyl-propionylamino)-5-guanid...)
Affinity DataKi:  7.18E+5nM. Assay description: Inhibitory activity against beta-kallikrein
In DepthDetails ArticlePubMed