BDBM50004628 4-(2-Chloro-phenyl)-2-methyl-6-[4-(2-methyl-imidazo[4,5-c]pyridin-1-yl)-phenyl]-1,4-dihydro-pyridine-3,5-dicarboxylic acid 5-ethyl ester (0.66 H2O)::CHEMBL108260
SMILES CCOC(=O)C1=C(N=C(C)C(C1c1ccccc1Cl)C(O)=O)c1ccc(cc1)-n1c(C)nc2cnccc12
InChI Key InChIKey=RQMOKABXCISOAX-UHFFFAOYSA-N
Data  1 IC50
  Tab Delimited (TSV)   2D SDfile   Computed 3D by Vconf -m prep SDfile
Find this compound or compounds like it in BindingDB:
Activity Spreadsheet -- Enzyme Inhibition Constant Data from BindingDB
Found 1 hit for monomerid = 50004628
TargetPlatelet-activating factor receptor(Cavia porcellus)
Pfizer
Curated by ChEMBL
LigandPNGBDBM50004628(4-(2-Chloro-phenyl)-2-methyl-6-[4-(2-methyl-imidaz...)
Affinity DataIC50:  14nM. Assay description: In vitro inhibition of PAF-induced aggregation of rabbit washed platelets.
In DepthDetails ArticlePubMed