BDBM50004741 CHEMBL427978::Hirudin analogue
SMILES CC[C@H](C)[C@H](NC(=O)[C@@H]1CCCN1C(=O)[C@H](CCC(O)=O)NC(=O)[C@H](Cc1ccccc1)NC(=O)[C@H](CC(O)=O)NC(=O)C\C=C\CNC(=O)C\C=C\CNC(=O)CCCCC(=O)C(CCCNC(N)=N)NC(=O)[C@@H]1CCCN1C(=O)[C@H](Cc1ccccc1)NC(C)=O)C(=O)N1CCC[C@H]1C(=O)N[C@@H](CC(C)C)C(O)=O
InChI Key InChIKey=AZJJCKYIZGOVJB-SWVKRCEDSA-N
Data  1 KI
  Tab Delimited (TSV)   2D SDfile   Computed 3D by Vconf -m prep SDfile
Find this compound or compounds like it in BindingDB:
Activity Spreadsheet -- Enzyme Inhibition Constant Data from BindingDB
Found 1 hit for monomerid = 50004741
TargetProthrombin(Homo sapiens (Human))
National Research Council Of Canada
Curated by ChEMBL
LigandPNGBDBM50004741(CHEMBL427978 | Hirudin analogue)
Affinity DataKi:  3.5nM. Assay description: Compound was evaluated for their ability to inhibit the alpha-thrombin-mediated hydrolysis of the fluorescent substrate Tos-Gly-Pro-Arg-Amc
In DepthDetails ArticlePubMed