BDBM50004950 4-Methoxy-quinoline-2-carboxylic acid::CHEMBL51773
SMILES COc1cc(nc2ccccc12)C(O)=O
InChI Key InChIKey=AVBKMSSLAIKOGM-UHFFFAOYSA-N
Data  1 IC50
  Tab Delimited (TSV)   2D SDfile   Computed 3D by Vconf -m prep SDfile
Find this compound or compounds like it in BindingDB:
Activity Spreadsheet -- Enzyme Inhibition Constant Data from BindingDB
Found 1 hit for monomerid = 50004950
TargetGlutamate receptor ionotropic, NMDA 1(RAT)
Marion Merrell Dow Research Institute
Curated by ChEMBL
LigandPNGBDBM50004950(4-Methoxy-quinoline-2-carboxylic acid | CHEMBL5177...)
Affinity DataIC50: >1.00E+5nM. Assay description: The compound was evaluated for the ability to compete with [3H]-glycine for strychnine-insensitive binding sites on rat cortical and hippocampal memb...
In DepthDetails ArticlePubMed