BDBM50005121 (R)3,5-Dichloro-N-(1-ethyl-pyrrolidin-2-ylmethyl)-2-hydroxy-6-methoxy-benzamide::CHEMBL308129
SMILES CCN1CCC[C@@H]1CNC(=O)c1c(O)c(Cl)cc(Cl)c1OC
InChI Key InChIKey=WAOQONBSWFLFPE-SECBINFHSA-N
Data  2 IC50
  Tab Delimited (TSV)   2D SDfile   Computed 3D by Vconf -m prep SDfile
Find this compound or compounds like it in BindingDB:
Activity Spreadsheet -- Enzyme Inhibition Constant Data from BindingDB
Found 2 hits for monomerid = 50005121
TargetD(1A)/D(1B)/D(2)/D(3)/D(4) dopamine receptor(Rattus norvegicus (rat))
TBA
Curated by ChEMBL
LigandPNGBDBM50005121((R)3,5-Dichloro-N-(1-ethyl-pyrrolidin-2-ylmethyl)-...)
Affinity DataIC50:  2.92E+3nM. Assay description: Antidopamine activity in vitro by ability to displace [3H]spiperone from rat brain striatal preparations.
In DepthDetails ArticlePubMed
TargetD(2) dopamine receptor(Rattus norvegicus (rat))
University Of Lund
Curated by ChEMBL
LigandPNGBDBM50005121((R)3,5-Dichloro-N-(1-ethyl-pyrrolidin-2-ylmethyl)-...)
Affinity DataIC50:  2.92E+3nM. Assay description: Inhibitory concentration required for displacing radioligand [3H]SPI from Dopamine receptor D2
In DepthDetails ArticlePubMed