BDBM50005124 1-(3-Chloro-phenyl)-4-methyl-piperazine::CHEMBL26737
SMILES CN1CCN(CC1)c1cccc(Cl)c1
InChI Key InChIKey=BGVQAXHXGFPYTQ-UHFFFAOYSA-N
Data  4 KI
  Tab Delimited (TSV)   2D SDfile   Computed 3D by Vconf -m prep SDfile
Find this compound or compounds like it in BindingDB:
Activity Spreadsheet -- Enzyme Inhibition Constant Data from BindingDB
Found 4 hits for monomerid = 50005124
Target5-hydroxytryptamine receptor 1A(Rattus norvegicus (rat))
Universit£
Curated by ChEMBL
LigandPNGBDBM50005124(1-(3-Chloro-phenyl)-4-methyl-piperazine | CHEMBL26...)
Affinity DataKi:  151nM. Assay description: Binding affinity of a compound to rat brain 5-hydroxytryptamine 1A (serotonin) receptor assayed by radiolabeled [3H]-8-OH-DPAT ligand displacement
In DepthDetails ArticlePubMed
Target5-hydroxytryptamine receptor 1A(Rattus norvegicus (rat))
Universit£
Curated by ChEMBL
LigandPNGBDBM50005124(1-(3-Chloro-phenyl)-4-methyl-piperazine | CHEMBL26...)
Affinity DataKi:  152nM. Assay description: In vitro ability to displace [3H]-8-hydroxy-2-(di-n-propylamino) tetralin binding from 5-hydroxytryptamine 1A receptor site in rat brain hippocampus
In DepthDetails ArticlePubMed
Target5-hydroxytryptamine receptor 1A(Rattus norvegicus (rat))
Universit£
Curated by ChEMBL
LigandPNGBDBM50005124(1-(3-Chloro-phenyl)-4-methyl-piperazine | CHEMBL26...)
Affinity DataKi:  152nM. Assay description: Displacement of radioligand [3H]-2-(di-N-propylamino)-8-hydroxytetralin from 5-hydroxytryptamine 1A receptor in rat frontal cortex homogenate
In DepthDetails ArticlePubMed
TargetNeuronal acetylcholine receptor subunit alpha-4/beta-2(Rattus norvegicus (Rat))
Universit£
Curated by ChEMBL
LigandPNGBDBM50005124(1-(3-Chloro-phenyl)-4-methyl-piperazine | CHEMBL26...)
Affinity DataKi: >1.00E+4nM. Assay description: Binding affinity against nicotinic receptors from rat brain using [3H]cystine as radioligand
In DepthDetails ArticlePubMed