BDBM50005126 1-Allyl-4-(3-chloro-phenyl)-piperazine::CHEMBL76783
SMILES Clc1cccc(c1)N1CCN(CC=C)CC1
InChI Key InChIKey=XEMWXLIWDOJAHL-UHFFFAOYSA-N
Data  1 KI
  Tab Delimited (TSV)   2D SDfile   Computed 3D by Vconf -m prep SDfile
Find this compound or compounds like it in BindingDB:
Activity Spreadsheet -- Enzyme Inhibition Constant Data from BindingDB
Found 1 hit for monomerid = 50005126
Target5-hydroxytryptamine receptor 1A(Rattus norvegicus (rat))
Polish Academy Of Sciences
Curated by ChEMBL
LigandPNGBDBM50005126(1-Allyl-4-(3-chloro-phenyl)-piperazine | CHEMBL767...)
Affinity DataKi:  251nM. Assay description: In vitro ability to displace [3H]-8-hydroxy-2-(di-n-propylamino) tetralin binding from 5-hydroxytryptamine 1A receptor site in rat brain hippocampus
In DepthDetails ArticlePubMed