BDBM50005131 1-Benzyl-4-(3-chloro-phenyl)-piperazine::CHEMBL27298
SMILES Clc1cccc(c1)N1CCN(Cc2ccccc2)CC1
InChI Key InChIKey=ZRJKAGCSCSIIJA-UHFFFAOYSA-N
Data  2 KI
  Tab Delimited (TSV)   2D SDfile   Computed 3D by Vconf -m prep SDfile
Find this compound or compounds like it in BindingDB:
Activity Spreadsheet -- Enzyme Inhibition Constant Data from BindingDB
Found 2 hits for monomerid = 50005131
Target5-hydroxytryptamine receptor 1A(Rattus norvegicus (rat))
Universit£
Curated by ChEMBL
LigandPNGBDBM50005131(1-Benzyl-4-(3-chloro-phenyl)-piperazine | CHEMBL27...)
Affinity DataKi:  166nM. Assay description: Binding affinity of a compound to rat brain 5-hydroxytryptamine 1A (serotonin) receptor assayed by radiolabeled [3H]-8-OH-DPAT ligand displacement
In DepthDetails ArticlePubMed
Target5-hydroxytryptamine receptor 1A(Rattus norvegicus (rat))
Universit£
Curated by ChEMBL
LigandPNGBDBM50005131(1-Benzyl-4-(3-chloro-phenyl)-piperazine | CHEMBL27...)
Affinity DataKi:  166nM. Assay description: In vitro ability to displace [3H]-8-hydroxy-2-(di-n-propylamino) tetralin binding from 5-hydroxytryptamine 1A receptor site in rat brain hippocampus
In DepthDetails ArticlePubMed