BDBM50005133 1-sec-Butyl-4-(3-chloro-phenyl)-piperazine::CHEMBL281918
SMILES CCC(C)N1CCN(CC1)c1cccc(Cl)c1
InChI Key InChIKey=INEJRUINWQMJAB-UHFFFAOYSA-N
Data  2 KI
  Tab Delimited (TSV)   2D SDfile   Computed 3D by Vconf -m prep SDfile
Find this compound or compounds like it in BindingDB:
Activity Spreadsheet -- Enzyme Inhibition Constant Data from BindingDB
Found 2 hits for monomerid = 50005133
Target5-hydroxytryptamine receptor 1A(Rattus norvegicus (rat))
Universit£
Curated by ChEMBL
LigandPNGBDBM50005133(1-sec-Butyl-4-(3-chloro-phenyl)-piperazine | CHEMB...)
Affinity DataKi:  126nM. Assay description: Binding affinity of a compound to rat brain 5-hydroxytryptamine 1A (serotonin) receptor assayed by radiolabeled [3H]-8-OH-DPAT ligand displacement
In DepthDetails ArticlePubMed
Target5-hydroxytryptamine receptor 1A(Rattus norvegicus (rat))
Universit£
Curated by ChEMBL
LigandPNGBDBM50005133(1-sec-Butyl-4-(3-chloro-phenyl)-piperazine | CHEMB...)
Affinity DataKi:  127nM. Assay description: In vitro ability to displace [3H]-8-hydroxy-2-(di-n-propylamino) tetralin binding from 5-hydroxytryptamine 1A receptor site in rat brain hippocampus
In DepthDetails ArticlePubMed