BDBM50005163 4-(4-Chloro-benzenesulfonylaminocarbonyl)-N-[1-(indan-2-yl-{[2-methyl-1-(4-trifluoromethyl-benzoyl)-propylcarbamoyl]-methyl}-carbamoyl)-2-methyl-propyl]-benzamide::CHEMBL160154
SMILES CC(C)C(NC(=O)c1ccc(cc1)C(=O)NS(=O)(=O)c1ccc(Cl)cc1)C(=O)N(CC(=O)N[C@@H](C(C)C)C(=O)c1ccc(cc1)C(F)(F)F)C1Cc2ccccc2C1
InChI Key InChIKey=KIESORUSQXHCPP-NWDJCJOJSA-N
Data  1 IC50
  Tab Delimited (TSV)   2D SDfile   Computed 3D by Vconf -m prep SDfile
Find this compound or compounds like it in BindingDB:
Activity Spreadsheet -- Enzyme Inhibition Constant Data from BindingDB
Found 1 hit for monomerid = 50005163
TargetNeutrophil elastase(Homo sapiens (Human))
Boehringer Ingelheim Pharmaceuticals
Curated by ChEMBL
LigandPNGBDBM50005163(4-(4-Chloro-benzenesulfonylaminocarbonyl)-N-[1-(in...)
Affinity DataIC50:  5.10E+3nM. Assay description: In vitro inhibitory activity against human leukocyte elastase
In DepthDetails ArticlePubMed