BDBM50005167 4-(4-Chloro-benzenesulfonylaminocarbonyl)-N-(1-{furan-2-ylmethyl-[(3,3,3-trifluoro-1-isopropyl-2-oxo-propylcarbamoyl)-methyl]-carbamoyl}-2-methyl-propyl)-benzamide::CHEMBL422356
SMILES CC(C)C(NC(=O)c1ccc(cc1)C(=O)NS(=O)(=O)c1ccc(Cl)cc1)C(=O)N(CC(=O)NC(C(C)C)C(=O)C(F)(F)F)Cc1ccco1
InChI Key InChIKey=VDKJYEIAMZITMG-UHFFFAOYSA-N
Data  1 IC50
  Tab Delimited (TSV)   2D SDfile   Computed 3D by Vconf -m prep SDfile
Find this compound or compounds like it in BindingDB:
Activity Spreadsheet -- Enzyme Inhibition Constant Data from BindingDB
Found 1 hit for monomerid = 50005167
TargetNeutrophil elastase(Homo sapiens (Human))
Boehringer Ingelheim Pharmaceuticals
Curated by ChEMBL
LigandPNGBDBM50005167(4-(4-Chloro-benzenesulfonylaminocarbonyl)-N-(1-{fu...)
Affinity DataIC50:  138nM. Assay description: In vitro inhibitory activity against human leukocyte elastase
In DepthDetails ArticlePubMed