BDBM50005312 5-[2-(3-Acetylamino-2-oxo-4-phenyl-piperidin-1-yl)-hexanoylamino]-6-cyclohexyl-4-hydroxy-2-isopropyl-hexanoic acid butylamide::CHEMBL350358
SMILES CCCCNC(=O)[C@@H](C[C@H](O)[C@H](CC1CCCCC1)NC(=O)[C@H](CCCC)N1CC[C@@H]([C@H](NC(C)=O)C1=O)c1ccccc1)C(C)C
InChI Key InChIKey=QVBRROKTJAJURJ-SDCRPUFZSA-N
Data  1 IC50
  Tab Delimited (TSV)   2D SDfile   Computed 3D by Vconf -m prep SDfile
Find this compound or compounds like it in BindingDB:
Activity Spreadsheet -- Enzyme Inhibition Constant Data from BindingDB
Found 1 hit for monomerid = 50005312
TargetRenin(Homo sapiens (Human))
Merck Sharp And Dohme Research Laboratories
Curated by ChEMBL
LigandPNGBDBM50005312(5-[2-(3-Acetylamino-2-oxo-4-phenyl-piperidin-1-yl)...)
Affinity DataIC50:  21nMpH: 7.4Assay Description:Compound was evaluated for the inhibition of human plasma renin at pH 7.4
In DepthDetails ArticlePubMed