BDBM50005419 3-Hydroxy-6-methyl-4-[2-methylsulfanyl-2-(3-naphthalen-1-yl-2-naphthalen-1-ylmethyl-propionylamino)-acetylamino]-heptanoic acid (2-methyl-butyl)-amide::CHEMBL3350035
SMILES CC[C@H](C)CNC(=O)C[C@H](O)[C@H](CC(C)C)NC(=O)C(NC(=O)C(Cc1cccc2ccccc12)Cc1cccc2ccccc12)SC
InChI Key InChIKey=WBXOUUSSLFJVAX-BEVZPBBUSA-N
Data  1 IC50
  Tab Delimited (TSV)   2D SDfile   Computed 3D by Vconf -m prep SDfile
Find this compound or compounds like it in BindingDB:
Activity Spreadsheet -- Enzyme Inhibition Constant Data from BindingDB
Found 1 hit for monomerid = 50005419
TargetRenin(Homo sapiens (Human))
Warner-Lambert
Curated by ChEMBL
LigandPNGBDBM50005419(3-Hydroxy-6-methyl-4-[2-methylsulfanyl-2-(3-naphth...)
Affinity DataIC50:  95nM. Assay description: Inhibitory activity against monkey renin in vitro.
In DepthDetails ArticlePubMed